BDBM50146739 (S)-(4,6-Dimethyl-pyrimidin-2-yloxy)-((S)-2-oxo-1-pentafluorophenylmethyl-5-phenyl-2,3,4,5-tetrahydro-1H-benzo[e][1,4]diazepin-5-yl)-acetic acid::CHEMBL406551
SMILES Cc1cc(C)nc(O[C@H](C(O)=O)[C@]2(NCC(=O)N(Cc3c(F)c(F)c(F)c(F)c3F)c3ccccc23)c2ccccc2)n1
InChI Key InChIKey=DVNMKMKQUAYZDJ-OFSOJUDTSA-N
Data  2 IC50
  Tab Delimited (TSV)   2D SDfile   Computed 3D by Vconf -m prep SDfile
Find this compound or compounds like it in BindingDB:
Activity Spreadsheet -- Enzyme Inhibition Constant Data from BindingDB
Found 1 hit for monomerid = 50146739
TargetEndothelin receptor type B(Homo sapiens (Human))
Actelion Pharmaceuticals
Curated by ChEMBL
LigandPNGBDBM50146739((S)-(4,6-Dimethyl-pyrimidin-2-yloxy)-((S)-2-oxo-1-...)
Affinity DataIC50:  28.8nM. Assay description: Antagonist activity towards human recombinant Endothelin B receptor expressed in chinese hamster ovary (CHO) cells determined using [125I]-ET-1 as ra...
In DepthDetails ArticlePubMed